{"text_format":"1","workbook":"xlsx","n_sheets":5,"sheets":["Datos","Prov_Clie","Clie_Prov","Anexos","Hoja1"],"not_rendered":{"charts":0,"images":1,"macros":1,"external_links":1,"defined_names":1,"comments":0,"pivot_tables":0},"unopened":[],"bounds":{"document_bytes":16777216,"sheet_cells":100000,"rows_first":2000,"rows_last":500,"rows_between":2000,"halvings":0,"cell_chars":16384,"cell_head_chars":4096},"cells_cut":0,"cells_raw":0,"read":"whole","date_system":"1900"}

{"sheet":"Datos","index":0,"n_rows":38,"n_cols":15,"rows_kept":38,"cut":false,"hidden":false,"merged":[[7,4,7,11],[9,5,9,10],[26,4,26,13],[37,6,37,9]]}
[]
[]
[]
[null,"App pago de detracciones : Por internet y/o BN - NPD"]
[null,null,"Datos de la empresa"]
[]
[]
[null,null,null,null,"Ingrese número de Ruc"]
[]
[null,null,null,null,null,20397609082]
[]
[]
[]
[]
[]
[null,null,null,"N° Ruc",20397609082]
[]
[]
[null,null,null,"Razón Social","REPALSA S.A."]
[]
[]
[null,null,null,"Nro de Cuenta","00741151820"]
[]
[]
[null,null,null,"Ruta Txt","C:\\Users\\CONTADOR\\Desktop"]
[]
[]
[]
[]
[]
[]
[]
[]
[]
[]
[]
[null,null,null,null,null,null,null,null,null,null,null,null,null,null," "]
[null,null,"https://www.noticierocontable.com/",null,null,null,"<--Contactos -->",null,null,null,null,null,null,"http://kunan.es/"]

{"sheet":"Prov_Clie","index":1,"n_rows":101,"n_cols":13,"rows_kept":101,"cut":false,"hidden":false,"merged":[]}
[]
[null,null,"Proveedor",{"$f":"CONCATENATE(Datos!E16,\" - \",Datos!E19)","v":"20397609082 - REPALSA S.A."}]
[]
[null,null,"N° Lote",220006,"Importe :",{"$f":"SUM($H$13:$H$993)","v":28454}]
[]
[null,null,"POR INTERNET - Proveedor con múltiples adquirientes"]
[]
[null,null,"DATOS DEL CLIENTE",null,null,"INFORMACION RESPECTO AL DEPOSITO",null,null,null,null," DATOS DEL COMPROBANTE"]
[]
[]
[null,null,"TIPO","N° RUC","NOMBRES / RAZON SOCIAL"," N° PROFORM "," Bs / Ss "," IMPORTE "," TIPO OPERACION "," PERIODO "," TIPO "," SERIE "," NUMERO "]
[]
[null,null,6,"20559605850","RABSA INGENIERIA Y CONSTRUCCION S.A.C.",0,37,507,1,202204,"01","F001","0044296"]
[null,null,6,"20440492283","CONSTRUCTORA MORENO LINCH S.A.C.",0,37,94,1,202204,"01","F001","0044302"]
[null,null,6,"20482115005","CORPORACION RC S.A.C.",0,37,346,1,202204,"01","F001","0044304"]
[null,null,6,"20482115005","CORPORACION RC S.A.C.",0,37,346,1,202204,"01","F001","0044305"]
[null,null,6,"20482115005","CORPORACION RC S.A.C.",0,37,346,1,202204,"01","F001","0044306"]
[null,null,6,"20482115005","CORPORACION RC S.A.C.",0,37,346,1,202204,"01","F001","0044307"]
[null,null,6,"20482115005","CORPORACION RC S.A.C.",0,37,346,1,202204,"01","F001","0044308"]
[null,null,6,"20440492283","CONSTRUCTORA MORENO LINCH S.A.C.",0,37,335,1,202204,"01","F001","0044309"]
[null,null,6,"20440492283","CONSTRUCTORA MORENO LINCH S.A.C.",0,37,222,1,202204,"01","F001","0044310"]
[null,null,6,"20480962983","COMPAÑIA DE EQUIPAMIENTO ELECTRICO INTEGRAL E INDUSTRIAL S.R.L.",0,37,381,1,202204,"01","F001","0044311"]
[null,null,6,"20480962983","COMPAÑIA DE EQUIPAMIENTO ELECTRICO INTEGRAL E INDUSTRIAL S.R.L.",0,37,163,1,202204,"01","F001","0044312"]
[null,null,6,"20481886300","CONSTRUCTORA CIEZA TEJADA EMPRESA INDIVIDUAL DE RESPONSABILIDAD LIMITADA",0,37,223,1,202204,"01","F001","0044327"]
[null,null,6,"20540046566","VIAGO CONSTRUCTORES E.I.R.L.",0,37,104,1,202204,"01","F001","0044339"]
[null,null,6,"20482182292","CONSTRUCTORA E INMOBILIARIA JOSHUA SRL",0,37,127,1,202204,"01","F001","0044341"]
[null,null,6,"20544771478","LCL CONTRATISTAS S.A.C.",0,37,102,1,202204,"01","F001","0044343"]
[null,null,6,"20480962983","COMPAÑIA DE EQUIPAMIENTO ELECTRICO INTEGRAL E INDUSTRIAL S.R.L.",0,37,638,1,202204,"01","F001","0044349"]
[null,null,6,"20480962983","COMPAÑIA DE EQUIPAMIENTO ELECTRICO INTEGRAL E INDUSTRIAL S.R.L.",0,37,783,1,202204,"01","F001","0044361"]
[null,null,6,"20481871027","BRALCO CONTRATISTAS GENERALES S.R.L.",0,37,462,1,202204,"01","F001","0044406"]
[null,null,6,"20540046566","VIAGO CONSTRUCTORES E.I.R.L.",0,37,94,1,202204,"01","F001","0044432"]
[null,null,6,"20606301562","CONSORCIO CAPITAL",0,37,279,1,202204,"01","F001","0044437"]
[null,null,6,"20606301562","CONSORCIO CAPITAL",0,37,141,1,202204,"01","F001","0044439"]
[null,null,6,"20440492283","CONSTRUCTORA MORENO LINCH S.A.C.",0,37,355,1,202204,"01","F001","0044441"]
[null,null,6,"20603052022","GRUPO MASEPRO S.A.C.",0,37,225,1,202204,"01","F001","0044442"]
[null,null,6,"20603052022","GRUPO MASEPRO S.A.C.",0,37,228,1,202204,"01","F001","0044444"]
[null,null,6,"20603052022","GRUPO MASEPRO S.A.C.",0,37,245,1,202204,"01","F001","0044445"]
[null,null,6,"20606413077","3A COMPAÑÍA FERRETERA S.R.L.",0,37,533,1,202204,"01","F001","0044447"]
[null,null,6,"20603052022","GRUPO MASEPRO S.A.C.",0,37,130,1,202204,"01","F001","0044449"]
[null,null,6,"20559605850","RABSA INGENIERIA Y CONSTRUCCION S.A.C.",0,37,343,1,202204,"01","F001","0044450"]
[null,null,6,"20482628487","P&G GROUP S.A.C.",0,37,520,1,202204,"01","F001","0044466"]
[null,null,6,"20481871027","BRALCO CONTRATISTAS GENERALES S.R.L.",0,37,92,1,202204,"01","F001","0044467"]
[null,null,6,"20477322477","GRUPO CONSTRUCTOR FOCSA S.A.C.",0,37,115,1,202204,"01","F001","0044474"]
[null,null,6,"20540046566","VIAGO CONSTRUCTORES E.I.R.L.",0,37,109,1,202204,"01","F001","0044478"]
[null,null,6,"20559605850","RABSA INGENIERIA Y CONSTRUCCION S.A.C.",0,37,158,1,202204,"01","F001","0044503"]
[null,null,6,"20603944659","CORPORACION SAYERI E.I.R.L.",0,37,84,1,202204,"01","F001","0044504"]
[null,null,6,"20477160710","LANVAS PERU S.A.C.",0,37,191,1,202204,"01","F001","0044511"]
[null,null,6,"20477160710","LANVAS PERU S.A.C.",0,37,190,1,202204,"01","F001","0044512"]
[null,null,6,"20477160710","LANVAS PERU S.A.C.",0,37,190,1,202204,"01","F001","0044513"]
[null,null,6,"20477160710","LANVAS PERU S.A.C.",0,37,326,1,202204,"01","F001","0044514"]
[null,null,6,"20482010165","COMERCIALIZADORA Y CONSTRUCTORA C & C S.A.C.",0,37,94,1,202204,"01","F001","0044531"]
[null,null,6,"20397093761","COCSA CONTRATISTAS GENERALES S.A.C.",0,37,157,1,202204,"01","F001","0044542"]
[null,null,6,"20529656751","CONSTRUNORT CAJAMARCA S.R.L.",0,37,212,1,202204,"01","F001","0044545"]
[null,null,6,"20529656751","CONSTRUNORT CAJAMARCA S.R.L.",0,37,203,1,202204,"01","F001","0044546"]
[null,null,6,"20396681651","CHC INGENIEROS S.A.",0,37,195,1,202204,"01","F001","0044552"]
[null,null,6,"20482261168","CONSTRUCTORA HERCULES S.A.C.",0,37,103,1,202204,"01","F001","0044554"]
[null,null,6,"20481561265","CRES PERU CONTRATISTAS GENERALES S.A.C.",0,37,90,1,202204,"01","F001","0044560"]
[null,null,6,"20482010165","COMERCIALIZADORA Y CONSTRUCTORA C & C S.A.C.",0,37,345,1,202204,"01","F001","0044561"]
[null,null,6,"20482010165","COMERCIALIZADORA Y CONSTRUCTORA C & C S.A.C.",0,37,374,1,202204,"01","F001","0044562"]
[null,null,6,"20482115005","CORPORACION RC S.A.C.",0,37,1850,1,202204,"01","F001","0044563"]
[null,null,6,"20480962983","COMPAÑIA DE EQUIPAMIENTO ELECTRICO INTEGRAL E INDUSTRIAL S.R.L.",0,37,393,1,202204,"01","F001","0044564"]
[null,null,6,"20608828860","CONSORCIO EDUCATIVO PISHAULI",0,37,113,1,202204,"01","F001","0044623"]
[null,null,6,"20396681651","CHC INGENIEROS S.A.",0,37,268,1,202204,"01","F001","0044628"]
[null,null,6,"20600813715","CORPORACION SORIANO L & C S.A.C.",0,37,92,1,202204,"01","F001","0044630"]
[null,null,6,"20600813715","CORPORACION SORIANO L & C S.A.C.",0,37,92,1,202204,"01","F001","0044637"]
[null,null,6,"20559944395","NASSI INGENIERIA & PROYECTOS S.A.C.",0,37,93,1,202204,"01","F001","0044643"]
[null,null,6,"20559944395","NASSI INGENIERIA & PROYECTOS S.A.C.",0,37,93,1,202204,"01","F001","0044644"]
[null,null,6,"20559944395","NASSI INGENIERIA & PROYECTOS S.A.C.",0,37,133,1,202204,"01","F001","0044645"]
[null,null,6,"20482628487","P&G GROUP S.A.C.",0,37,329,1,202204,"01","F001","0044647"]
[null,null,6,"20482820591","CRUZ ALVARADO CONSTRUCTORA S.A.C.",0,37,1112,1,202204,"01","F001","0044648"]
[null,null,6,"20482820591","CRUZ ALVARADO CONSTRUCTORA S.A.C.",0,37,129,1,202204,"01","F001","0044649"]
[null,null,6,"20544771478","LCL CONTRATISTAS S.A.C.",0,37,335,1,202204,"01","F001","0044652"]
[null,null,6,"20482115005","CORPORACION RC S.A.C.",0,37,1605,1,202204,"01","F001","0044656"]
[null,null,6,"20482115005","CORPORACION RC S.A.C.",0,37,1605,1,202204,"01","F001","0044657"]
[null,null,6,"20482010165","COMERCIALIZADORA Y CONSTRUCTORA C & C S.A.C.",0,37,151,1,202204,"01","F001","0044658"]
[null,null,6,"20481871027","BRALCO CONTRATISTAS GENERALES S.R.L.",0,37,353,1,202204,"01","F001","0044659"]
[null,null,6,"20481672172","HUAMAN & JAVE SAC",0,37,234,1,202204,"01","F001","0044660"]
[null,null,6,"20481871027","BRALCO CONTRATISTAS GENERALES S.R.L.",0,37,98,1,202204,"01","F001","0044661"]
[null,null,6,"20607426466","CONSORCIO ÚNICO",0,37,147,1,202204,"01","F001","0044662"]
[null,null,6,"20482720961","REPRESENTACIONES BARCH E.I.R.L.",0,37,100,1,202204,"01","F001","0044681"]
[null,null,6,"20482010165","COMERCIALIZADORA Y CONSTRUCTORA C & C S.A.C.",0,37,99,1,202204,"01","F001","0044682"]
[null,null,6,"20531750749","CONTRATISTAS GENERALES ASOCIADOS GM S.A.C.",0,37,349,1,202204,"01","F002","0022724"]
[null,null,6,"20481206104","A-F & ASOCIADOS S.A.C",0,37,96,1,202204,"01","F003","0008466"]
[null,null,6,"20481989532","SAN SEBASTIAN INVERSIONES & CONSTRUCCIONES S.A.C.",0,37,170,1,202204,"01","F003","0008484"]
[null,null,6,"20481206104","A-F & ASOCIADOS S.A.C",0,37,345,1,202204,"01","F003","0008607"]
[null,null,6,"20510620195","INVERSIONES PRO3 SAC",0,37,104,1,202204,"01","F003","0008612"]
[null,null,6,"20510620195","INVERSIONES PRO3 SAC",0,37,104,1,202204,"01","F003","0008613"]
[null,null,6,"20510620195","INVERSIONES PRO3 SAC",0,37,104,1,202204,"01","F003","0008614"]
[null,null,6,"20481206104","A-F & ASOCIADOS S.A.C",0,37,257,1,202204,"01","F003","0008618"]
[null,null,6,"20481206104","A-F & ASOCIADOS S.A.C",0,37,163,1,202204,"01","F003","0008619"]
[null,null,6,"20482093354","J.J. MEDUR CONTRATISTAS GENERALES S.A.C.",0,37,109,1,202204,"01","F003","0008621"]
[null,null,6,"20481672172","HUAMAN & JAVE SAC",0,37,119,1,202204,"01","F003","0008629"]
[null,null,6,"20481672172","HUAMAN & JAVE SAC",0,37,112,1,202204,"01","F003","0008659"]
[null,null,6,"20600198255","L Y L KUSKALLA S.A.C.",0,37,1428,1,202204,"01","F003","0008666"]
[null,null,6,"20600198255","L Y L KUSKALLA S.A.C.",0,37,179,1,202204,"01","F003","0008667"]
[null,null,6,"20481206104","A-F & ASOCIADOS S.A.C",0,37,283,1,202204,"01","F003","0008688"]
[null,null,6,"20481206104","A-F & ASOCIADOS S.A.C",0,37,100,1,202204,"01","F003","0008689"]
[null,null,6,"20481206104","A-F & ASOCIADOS S.A.C",0,27,176,1,202204,"01","F006","0006636"]
[null,null,6,"20481206104","A-F & ASOCIADOS S.A.C",0,27,80,1,202204,"01","F006","0006637"]
[null,null,6,"20482115005","CORPORACION RC S.A.C.",0,19,354,1,202204,"01","F001","0044633"]
[null,null,6,20481886300,"CONSTRUCTORA CIEZA TEJADA EMPRESA INDIVIDUAL DE RESPONSABILIDAD LIMITADA",0,30,2206,1,202204,"01","F007","0000501"]

{"sheet":"Clie_Prov","index":2,"n_rows":1198,"n_cols":14,"rows_kept":1198,"cut":false,"hidden":false,"merged":[]}
[]
[null,null,"Proveedor",{"$f":"CONCATENATE(Datos!E16,\" - \",Datos!E19)","v":"20397609082 - REPALSA S.A."}]
[]
[null,null,"N° Lote",220005,"Importe :",{"$f":"SUM($I$13:$I$988)","v":4773}]
[]
[null,null,"POR INTERNET - Adquiriente con múltiples proveedores"]
[]
[null,null,"DATOS DEL PROVEEDOR",null,null,null,"INFORMACION RESPECTO AL DEPOSITO",null,null,null,null," DATOS DEL COMPROBANTE"]
[]
[]
[null,null,"TIPO","N° RUC","NOMBRES / RAZON SOCIAL"," N° PROFORM "," Bs / Ss "," CTA PROVEEDOR "," IMPORTE "," TIPO OPERACION "," PERIODO "," TIPO "," SERIE "," NUMERO "]
[]
[null,null,6,20100000688,{"$f":"IFERROR(VLOOKUP(D13,Anexos!$A$3:$C$130,2,FALSE),\"-\")","v":"ALMACENERA DEL PERU S A"},0,22,{"$f":"IFERROR(VLOOKUP(D13,Anexos!$A$3:$C$130,3,FALSE),\"-\")","v":"00000404977"},905,1,202203,1,"F031",13373]
[null,null,6,20100000688,{"$f":"IFERROR(VLOOKUP(D14,Anexos!$A$3:$C$130,2,FALSE),\"-\")","v":"ALMACENERA DEL PERU S A"},0,22,{"$f":"IFERROR(VLOOKUP(D14,Anexos!$A$3:$C$130,3,FALSE),\"-\")","v":"00000404977"},609,1,202203,1,"F031",13372]
[null,null,6,20100000688,{"$f":"IFERROR(VLOOKUP(D15,Anexos!$A$3:$C$130,2,FALSE),\"-\")","v":"ALMACENERA DEL PERU S A"},0,22,{"$f":"IFERROR(VLOOKUP(D15,Anexos!$A$3:$C$130,3,FALSE),\"-\")","v":"00000404977"},611,1,202204,1,"F031",13664]
[null,null,6,20100000688,{"$f":"IFERROR(VLOOKUP(D16,Anexos!$A$3:$C$130,2,FALSE),\"-\")","v":"ALMACENERA DEL PERU S A"},0,22,{"$f":"IFERROR(VLOOKUP(D16,Anexos!$A$3:$C$130,3,FALSE),\"-\")","v":"00000404977"},916,1,202204,1,"F031",13665]
[null,null,6,20502929675,{"$f":"IFERROR(VLOOKUP(D17,Anexos!$A$3:$C$130,2,FALSE),\"-\")","v":"LOGOS ETC E.I.R.L."},0,22,{"$f":"IFERROR(VLOOKUP(D17,Anexos!$A$3:$C$130,3,FALSE),\"-\")","v":"00051003667"},266,1,202204,1,"E001",33]
[null,null,6,10181235697,{"$f":"IFERROR(VLOOKUP(D18,Anexos!$A$3:$C$130,2,FALSE),\"-\")","v":"CASTILLO NEIRA BENITO SALOMON"},0,22,{"$f":"IFERROR(VLOOKUP(D18,Anexos!$A$3:$C$130,3,FALSE),\"-\")","v":"00771058027"},142,1,202204,1,"E001",99]
[null,null,6,20131644109,{"$f":"IFERROR(VLOOKUP(D19,Anexos!$A$3:$C$130,2,FALSE),\"-\")","v":"ESTUDIO VILLARAN Y DE LA ROSA, COLI"},0,22,{"$f":"IFERROR(VLOOKUP(D19,Anexos!$A$3:$C$130,3,FALSE),\"-\")","v":"00741059940"},142,1,202204,1,"E001",4294]
[null,null,6,20440429590,{"$f":"IFERROR(VLOOKUP(D20,Anexos!$A$3:$C$130,2,FALSE),\"-\")","v":"ARANCIBIA & BAZAN S. CIVIL DE R.L."},0,22,{"$f":"IFERROR(VLOOKUP(D20,Anexos!$A$3:$C$130,3,FALSE),\"-\")","v":"00741062518"},170,1,202204,1,"E001",6395]
[null,null,6,20539952413,{"$f":"IFERROR(VLOOKUP(D21,Anexos!$A$3:$C$130,2,FALSE),\"-\")","v":"ESCOBEDO MEDINA AUDITORES ASOCIADOS"},0,22,{"$f":"IFERROR(VLOOKUP(D21,Anexos!$A$3:$C$130,3,FALSE),\"-\")","v":"00761131567"},212,1,202204,1,"FE03",24]
[null,null,6,20440492283,{"$f":"IFERROR(VLOOKUP(D22,Anexos!$A$3:$C$130,2,FALSE),\"-\")","v":"CONSTRUCTORA MORENO LINCH S.A.C."},0,30,{"$f":"IFERROR(VLOOKUP(D22,Anexos!$A$3:$C$130,3,FALSE),\"-\")","v":"00741207265"},800,1,202204,1,"E001",14]
[]
[]
[]
[]
[]
[]
[]
[]
[]
[]
[]
[]
[]
[]
[]
[]
[]
[]
[]
[]
[]
[]
[]
[]
[]
[]
[]
[]
[]
[]
[]
[]
[]
[]
[]
[]
[]
[]
[]
[]
[]
[]
[]
[]
[]
[]
[]
[]
[]
[]
[]
[]
[]
[]
[]
[]
[]
[]
[]
[]
[]
[]
[]
[]
[]
[]
[]
[]
[]
[]
[]
[]
[]
[]
[]
[]
[]
[]
[]
[]
[]
[]
[]
[]
[]
[]
[]
[]
[]
[]
[]
[]
[]
[]
[]
[]
[]
[]
[]
[]
[]
[]
[]
[]
[]
[]
[]
[]
[]
[]
[]
[]
[]
[]
[]
[]
[]
[]
[]
[]
[]
[]
[]
[]
[]
[]
[]
[]
[]
[]
[]
[]
[]
[]
[]
[]
[]
[]
[]
[]
[]
[]
[]
[]
[]
[]
[]
[]
[]
[]
[]
[]
[]
[]
[]
[]
[]
[]
[]
[]
[]
[]
[]
[]
[]
[]
[]
[]
[]
[]
[]
[]
[]
[]
[]
[]
[]
[]
[]
[]
[]
[]
[]
[]
[]
[]
[]
[]
[]
[]
[]
[]
[]
[]
[]
[]
[]
[]
[]
[]
[]
[]
[]
[]
[]
[]
[]
[]
[]
[]
[]
[]
[]
[]
[]
[]
[]
[]
[]
[]
[]
[]
[]
[]
[]
[]
[]
[]
[]
[]
[]
[]
[]
[]
[]
[]
[]
[]
[]
[]
[]
[]
[]
[]
[]
[]
[]
[]
[]
[]
[]
[]
[]
[]
[]
[]
[]
[]
[]
[]
[]
[]
[]
[]
[]
[]
[]
[]
[]
[]
[]
[]
[]
[]
[]
[]
[]
[]
[]
[]
[]
[]
[]
[]
[]
[]
[]
[]
[]
[]
[]
[]
[]
[]
[]
[]
[]
[]
[]
[]
[]
[]
[]
[]
[]
[]
[]
[]
[]
[]
[]
[]
[]
[]
[]
[]
[]
[]
[]
[]
[]
[]
[]
[]
[]
[]
[]
[]
[]
[]
[]
[]
[]
[]
[]
[]
[]
[]
[]
[]
[]
[]
[]
[]
[]
[]
[]
[]
[]
[]
[]
[]
[]
[]
[]
[]
[]
[]
[]
[]
[]
[]
[]
[]
[]
[]
[]
[]
[]
[]
[]
[]
[]
[]
[]
[]
[]
[]
{"$rows_left_out":799}
{"sheet":"Anexos","index":3,"n_rows":109,"n_cols":3,"rows_kept":109,"cut":false,"hidden":false,"merged":[]}
[]
["RUC","RAZON SOCIAL","NRO CUENTA"]
[20100000688,"ALMACENERA DEL PERU S A","00000404977"]
[20131559764,"TRANSPORTES SAN FELIPE S A","00741086492"]
[20100612373,"ANDREA COMERCIAL S A ANCOSA","00000652253"]
[20543083888,"APM TERMINALS CALLAO SOCIEDAD ANONI","00005207037"]
[20440429590,"ARANCIBIA & BAZAN S. CIVIL DE R.L.","00741062518"]
[20508322870,"ARCOTECHO PERU S.A.C","00000466832"]
[10182130619,"AREDO ROSADO CLAUDIA MARLENE","00771013910"]
[20114136094,"AUTOMECANICA SAN MIGUEL S.R.L.","00781088560"]
[20506006024,"AUTOMOTORES GILDEMEISTER-PERU S.A.","00000785016"]
[20565765842,"BIMMERSHOP E.I.R.L.","00023034425"]
[20601359783,"C & A TRADING CORP S.A.C.","00741530570"]
[20521135809,"C Y M TRANSPORTES S.A.C.","00059008773"]
[10034971825,"CARREÑO SOSA MARIO","00671081234"]
[10181235697,"CASTILLO NEIRA BENITO SALOMON","00771058027"]
[20602940382,"CENFOLOG PERU SOCIEDAD ANONIMA CERR","00031126711"]
[20602230733,"CENTRO DE INSTRUCCION PREHOSPITALAR","00771039979"]
[20553448507,"CIBERGESTION PERU S.A.C.","00046131509"]
[20544206410,"CLINICA LA MERCED S.A.C.","00076054312"]
[20480962983,"COMPAÐIA DE EQUIPAMIENTO ELECTRICO ","00741319454"]
[20605637079,"CONSORCIO VICACC","00741651831"]
[20477638784,"CONSTRUCTORA JORZA S.A.C.","00771017940"]
[20606584122,"CONSTRUCTORA Y CONSULTORA SERVICIOS","00631385621"]
[20440272755,"CONSULTORIA GONZALEZ URRELO S.A.C.","00741640627"]
[20603343612,"CONTASISCORP SOCIEDAD ANONIMA CERRA","00008020779"]
[10178483728,"CORCUERA GARCIA MARCO ANTONIO","00741061503"]
[20314028164,"CORPORACION ASFALTOS Y PAVIMENTOS C","00231059822"]
[20603266120,"CORPORACION EUGENIO CARRANZA S.A.C.","00771051030"]
[20605089144,"DCC CONSTRUCTORA E INMOBILIARIA E.I","00771054420"]
[20603547269,"DISTRIBUIDORA REMUSA S.A.C.","00741584832"]
[20520588486,"DIVECENTER S.A.C.","00068169917"]
[20502797230,"DIVEIMPORT S.A.","00005080215"]
[20132162230,"EMPRESA EDITORA LA INDUSTRIA DE TRU","00741059959"]
[20482237291,"EMPRESA MIRANDA S.A.C.","00741194996"]
[20600071450,"EMPRESA OPERADORA TERRESTRE JBJ S.A","00371129669"]
[20481553670,"ENGINE BUSINESS SOLUTIONS S.A.C.","00741455102"]
[20265681299,"EQUIFAX PERU S.A.","00000426288"]
[20539952413,"ESCOBEDO MEDINA AUDITORES ASOCIADOS","00761131567"]
[20481806471,"ESTUDIO MARIÑAS & ABOGADOS SAC","00741148900"]
[20131644109,"ESTUDIO VILLARAN Y DE LA ROSA, COLI","00741059940"]
[20601034809,"EUROCAPITAL SERVICIOS FINANCIEROS S","00005318661"]
[20508074281,"EXPRESO GRAEL S.A.C.","00000821500"]
[20132108294,"FABRICACIONES METALICAS CARRANZA S.","00741048841"]
[10106993292,"FERNANDEZ BURGA JOSE MIGUEL","00231289984"]
[20603579721,"FONDO BP7 - FONDO DE INVERSION PRIV","00048086756"]
[20601367174,"FONDO DE INVERSION POR OFERTA PUBLI","00046229258"]
[10182114214,"GALVEZ RODRIGUEZ DAVID ENRIQUE","00741252988"]
[20545272769,"GAMBELL TRADING S.A.C.","00058216666"]
[20545573378,"GESTION MADERERA S.A.C.","00046001400"]
[20601230217,"GRUAS L & B E.I.R.L.","00025027205"]
[20517078931,"GRUPO PML S.A.C  AGENTES DE ADUANAS","00001046527"]
[20601158362,"GRUPO RUBYNELR S.A.C.","00781185043"]
[20559765385,"GT SOFTWARE S.A.C.","00741375796"]
[10181352260,"GUZMAN REBAZA JUAN MANUEL","00741243598"]
[20536557858,"HOMECENTERS PERUANOS S.A.","00098081909"]
[20481672172,"HUAMAN & JAVE SAC","00785003160"]
[20355156584,"IMPRENTA EDITORA GRAFICA REAL S.A.C","00741091453"]
[20481442924,"IMPRESOS CABRERA EIRL","00741273446"]
[20477289241,"INGELCOM PERU S.R.L.","00749002123"]
[20604019461,"INKA LIDER AUTOMOTRIZ SOCIEDAD ANON","00231307435"]
[20440376704,"INTERAMERICANA TRUJILLO S.A.","00741059142"]
[20440352431,"KVC CONTRATISTAS S.A.C.","00741207184"]
[20440330381,"L.C.F. DISTRIBUCIONES Y SERVICIOS S","00741065088"]
[20544771478,"LCL CONTRATISTAS S.A.C.","00003052613"]
[20482556125,"LIGA DEPORTIVA RECREATIVA DE TABLA ","00741215837"]
[20553510661,"LLAMA.PE S.A.","00004071239"]
[20502929675,"LOGOS ETC E.I.R.L.","00051003667"]
[20440475354,"MADERERA MERINO & GUTIERREZ S.A.C","00741052695"]
[20605161490,"MADERERA MERINO S.A.C.","00741629097"]
[20397561454,"MANNUCCI DIESEL SAC","00741072769"]
[20546924123,"MARMOLERIA JHIRE S.A.C.","00098089705"]
[10075521605,"MAS CARDENAS SANDRO RAUL","00000371157"]
[20559960595,"MEBUSTRACK S.A.C.","00741385864"]
[20259814210,"MEDITERRANEAN SHIPPING COMPANY DEL ","00001009389"]
[20347646891,"MEDLOG PERU S.A.","00000361151"]
[20440198415,"MULTIPLUS E.I.R.L.","00741114097"]
[20559944395,"NASSI INGENIERIA & PROYECTOS  S.A.C","00741372452"]
[20445412890,"NORMOTORS S.A.C.","00781048550"]
[20600695771,"NUBEFACT S.A.","00003186857"]
[20601444446,"NUESTRA CASA REVISTA INMOBILIARIA S","00741539411"]
[20517705951,"PERI - PERUANA SAC","00003005194"]
[20495821456,"PREFABRICADOS FERNANDEZ SOCIEDAD AN","00271005989"]
[20254053822,"PRODUCTOS DE ACERO CASSADO SA PRODA","00000333069"]
[20521685388,"QUANTUM VALUACIONES S.A.C.","00068159431"]
[10405718052,"RAMIREZ ACUÑA OMAR FRANCISCO","00631268528"]
[20481398763,"REMUSA S.R.L.","00741129132"]
[20403385949,"REPALSA SAC","00781180904"]
[20477373977,"REPRESENTACIONES DACA S.A.C.","00771016138"]
[20482805958,"ROARSA CONTRATISTAS GENERALES S.R.L","00741212633"]
[20551739075,"ROFFEL TRANSPORTES SOCIEDAD ANONIMA","00004065735"]
[20131911310,"SEDALIB S.A.","00741054361"]
[20131945214,"SELECTAS MADERAS DEL PERU","00741049546"]
[20525138985,"SENTINEL PER┌ S.A.","00023010054"]
[20520678043,"SERVI   EQUIPOS   INTERNACIONALES  ","00771004784"]
[20275873480,"SERVICENTRO RAMIREZ S.A.C.","00741126125"]
[20507852549,"SODEXO PASS PERU S.A.C.","00005078458"]
[20511128146,"TECNOLOGIA DE FLUIDOS SOCIEDAD ANON","00066017486"]
[20482155562,"TENNIS CUP E.I.R.L.","00741259281"]
[20544004973,"TRACKLOG S.A.C","00010011388"]
[20481720169,"TRANSPORTES E INVERSIONES BRUNO S.A","00741141639"]
[20132291714,"TRANSPORTES NARANJO S.A.C","00631079946"]
[20131559764,"TRANSPORTES SAN FELIPE S A","00741086492"]
[10464753538,"UCAÑAN ARZOLA JOEL MOISES","00741685477"]
[10188572192,"VASQUEZ SALAZAR CARLOS ROBERTO","00741375389"]
[20192402400,"WANCHAKO EIRL","00741121352"]
[20132381624,"YUGOCORP S.A.C.","00741060167"]
[10190726130,"ZAVALETA VASQUEZ SANTOS BENJAMIN","00741103133"]
[20440492283,"CONSTRUCTORA MORENO LINCH S.A.C.","00741207265"]

{"sheet":"Hoja1","index":4,"n_rows":15,"n_cols":7,"rows_kept":15,"cut":false,"hidden":false,"merged":[]}
["F001-16782",2200,2953.84,{"$f":"+C1*0.04","v":118.15360000000001},{"$f":"+B1-D1","v":2081.8463999999999},null,{"$f":"ROUND(D1,0)","v":118}]
["F001-16983",2200,2363.44,{"$f":"+C2*0.04","v":94.537599999999998},{"$f":"+B2-D2","v":2105.4623999999999},{"$f":"ROUND(E2,0)","v":2105},{"$f":"ROUND(D2,0)","v":95}]
["F001-16984",2200,2363.44,94.537599999999998,2105.4623999999999,{"$f":"ROUND(E3,0)","v":2105},{"$f":"ROUND(D3,0)","v":95}]
["F001-16985",2200,2363.44,94.537599999999998,2105.4623999999999,2105,95]
["F001-16986",2200,2363.44,94.537599999999998,2105.4623999999999,2105,95]
["F001-16987",2200,2363.44,94.537599999999998,2105.4623999999999,2105,95]
["F001-16988",2200,2363.44,94.537599999999998,2105.4623999999999,2105,95]
["F001-16989",2200,2363.44,94.537599999999998,2105.4623999999999,2105,95]
["F001-16990",2200,2363.44,94.537599999999998,2105.4623999999999,2105,95]
["F001-16991",2200,1932.42,77.296800000000005,2122.7031999999999,2123,77]
["F001-16998",2200,2363.44,94.537599999999998,2105.4623999999999,2105,95]
[]
[null,null,null,null,{"$f":"SUM(E2:E11)","v":21071.864799999999},{"$f":"SUM(F2:F11)","v":21068},"IMPORTE A PAGAR"]
[null,null,null,null,null,21050,"IMPORTE PAGADO"]
[null,null,null,null,null,{"$f":"+F13-F14","v":18},"DIFERENCIA"]